Reaction Details
TargetHistone deacetylase 1
LigandBDBM50222733
Substrate/Competitorn/a
Meas. Tech.ChEMBL_457993 (CHEMBL925324)
IC50 6.4±n/a nM
Citation Shivashimpi, GMAmagai, SKato, TNishino, NMaeda, SNishino, TGYoshida, M Molecular design of histone deacetylase inhibitors by aromatic ring shifting in chlamydocin framework. Bioorg Med Chem15:7830-9 (2007) 
 
Histone deacetylase 1
Name:Histone deacetylase 1
Type:Enzyme
Mol. Mass.:55090.27
Organism:Homo sapiens (Human)
Description:Q13547
Residue:482
BDBM50222733
NameBDBM50222733
Synonyms:CHEMBL393961 | cyclo(-L-Am7(S2Py)-Aib-L-Ser-D-Pro-)
TypeSmall organic molecule
Emp. Form.C24H35N5O5S2
Mol. Mass.537.695
SMILESCC1(C)NC(=O)[C@H](CCCCCSSc2ccccn2)NC(=O)[C@H]2CCCN2C(=O)[C@H](CO)NC1=O