Reaction Details
TargetHistone deacetylase 4
LigandBDBM50222736
Substrate/Competitorn/a
Meas. Tech.ChEMBL_457994 (CHEMBL925325)
IC50 1.6±n/a nM
Citation Shivashimpi, GMAmagai, SKato, TNishino, NMaeda, SNishino, TGYoshida, M Molecular design of histone deacetylase inhibitors by aromatic ring shifting in chlamydocin framework. Bioorg Med Chem15:7830-9 (2007) 
 
Histone deacetylase 4
Name:Histone deacetylase 4
Type:Enzyme
Mol. Mass.:119049.39
Organism:Homo sapiens (Human)
Description:P56524
Residue:1084
BDBM50222736
NameBDBM50222736
Synonyms:CHEMBL241555 | cyclo(-L-Am7(S2Py)-Aib-L-Ser(Bzl)-D-Pro-)
TypeSmall organic molecule
Emp. Form.C31H41N5O5S2
Mol. Mass.627.818
SMILESCC1(C)NC(=O)[C@H](CCCCCSSc2ccccn2)NC(=O)[C@H]2CCCN2C(=O)[C@H](COCc2ccccc2)NC1=O