Reaction Details
TargetHistone deacetylase 1
LigandBDBM50222737
Substrate/Competitorn/a
Meas. Tech.ChEMBL_457993 (CHEMBL925324)
IC50 4.7±n/a nM
Citation Shivashimpi, GMAmagai, SKato, TNishino, NMaeda, SNishino, TGYoshida, M Molecular design of histone deacetylase inhibitors by aromatic ring shifting in chlamydocin framework. Bioorg Med Chem15:7830-9 (2007) 
 
Histone deacetylase 1
Name:Histone deacetylase 1
Type:Enzyme
Mol. Mass.:55090.27
Organism:Homo sapiens (Human)
Description:Q13547
Residue:482
BDBM50222737
NameBDBM50222737
Synonyms:CHEMBL238587 | cyclo(-L-Am7(S2Py)-Aib-L-Ala-D-Tic-)
TypeSmall organic molecule
Emp. Form.C29H39N5O3S2
Mol. Mass.569.782
SMILESC[C@H]1CN2Cc3ccccc3C[C@@H]2C(=O)N[C@@H](CCCCCSSc2ccccn2)C(=O)NC(C)(C)C(=O)N1