Reaction Details
TargetHistone deacetylase 1
LigandBDBM50223505
Substrate/Competitorn/a
Meas. Tech.ChEMBL_461211 (CHEMBL926150)
IC50 38±n/a nM
Citation Nishino, NShivashimpi, GMSoni, PBBhuiyan, MPKato, TMaeda, SNishino, TGYoshida, M Interaction of aliphatic cap group in inhibition of histone deacetylases by cyclic tetrapeptides. Bioorg Med Chem16:437-45 (2008) 
 
Histone deacetylase 1
Name:Histone deacetylase 1
Type:Enzyme
Mol. Mass.:55090.27
Organism:Homo sapiens (Human)
Description:Q13547
Residue:482
BDBM50223505
NameBDBM50223505
Synonyms:(5S,11S,13aR)-5-((S)-sec-butyl)-8,8-dimethyl-11-[5-(pyridin-2-yldisulfanyl)-pentyl]-decahydro-3a,6,9,12-tetraaza-cyclopentacyclododecene-4,7,10,13-tetraone | CHEMBL253308
TypeSmall organic molecule
Emp. Form.C27H41N5O4S2
Mol. Mass.563.776
SMILESCC[C@H](C)[C@@H]1NC(=O)C(C)(C)NC(=O)[C@H](CCCCCSSc2ccccn2)NC(=O)[C@H]2CCCN2C1=O