Reaction Details
TargetKappa-type opioid receptor
LigandBDBM50159163
Substrate/Competitorn/a
Meas. Tech.ChEMBL_450228 (CHEMBL900506)
EC50 280±n/a nM
Citation Holden, KGTidgewell, KMarquam, ARothman, RBNavarro, HPrisinzano, TE Synthetic studies of neoclerodane diterpenes from Salvia divinorum: exploration of the 1-position. Bioorg Med Chem Lett17:6111-5 (2007) 
 
Kappa-type opioid receptor
Name:Kappa-type opioid receptor
Type:G Protein-Coupled Receptor (GPCR)
Mol. Mass.:42648.76
Organism:Homo sapiens (Human)
Description:P41145
Residue:380
BDBM50159163
NameBDBM50159163
Synonyms:(3S,4aR,4bS,6R,8R,8aR,10aR)-6-Acetoxy-3-furan-3-yl-4a,8a-dimethyl-1-oxo-dodecahydro-2-oxa-phenanthrene-8-carboxylic acid methyl ester CHEMBL365533
TypeSmall organic molecule
Emp. Form.C23H30O7
Mol. Mass.418.4801
SMILESCOC(=O)[C@@H]1C[C@@H](C[C@H]2[C@@]1(C)CC[C@H]1C(=O)O[C@@H](C[C@]21C)c1ccoc1)OC(C)=O