Reaction Details
TargetThymidylate kinase
LigandBDBM50223793
Substrate/Competitorn/a
Meas. Tech.ChEMBL_450257 (CHEMBL900534)
Ki 4900±n/a nM
Citation Van Daele, IMunier-Lehmann, HFroeyen, MBalzarini, JVan Calenbergh, S Rational design of 5'-thiourea-substituted alpha-thymidine analogues as thymidine monophosphate kinase inhibitors capable of inhibiting mycobacterial growth. J Med Chem50:5281-92 (2007) 
 
Thymidylate kinase
Name:Thymidylate kinase
Type:PROTEIN
Mol. Mass.:22636.29
Organism:Mycobacterium tuberculosis
Description:ChEMBL_208218
Residue:214
BDBM50223793
NameBDBM50223793
Synonyms:CHEMBL400409 | N-(benzhydryl)-N-(5'-deoxy-alpha-D-thymidin-5'-yl)thiourea
TypeSmall organic molecule
Emp. Form.C24H26N4O4S
Mol. Mass.466.553
SMILESCc1cn([C@@H]2C[C@H](O)[C@@H](CNC(=S)NC(c3ccccc3)c3ccccc3)O2)c(=O)[nH]c1=O