Reaction Details
TargetThymidylate kinase
LigandBDBM50223817
Substrate/Competitorn/a
Meas. Tech.ChEMBL_450257 (CHEMBL900534)
Ki 26500±n/a nM
Citation Van Daele, IMunier-Lehmann, HFroeyen, MBalzarini, JVan Calenbergh, S Rational design of 5'-thiourea-substituted alpha-thymidine analogues as thymidine monophosphate kinase inhibitors capable of inhibiting mycobacterial growth. J Med Chem50:5281-92 (2007) 
 
Thymidylate kinase
Name:Thymidylate kinase
Type:PROTEIN
Mol. Mass.:22636.29
Organism:Mycobacterium tuberculosis
Description:ChEMBL_208218
Residue:214
BDBM50223817
NameBDBM50223817
Synonyms:5'-azido-5'-deoxy-alpha-D-thymidine | CHEMBL235305
TypeSmall organic molecule
Emp. Form.C10H13N5O4
Mol. Mass.267.2413
SMILESCc1cn([C@@H]2C[C@H](O)[C@@H](CN=[N+]=[N-])O2)c(=O)[nH]c1=O