Reaction Details
TargetAlbumin
LigandBDBM50125289
Substrate/Competitorn/a
Meas. Tech.ChEMBL_458251 (CHEMBL925586)
Kd 740±n/a nM
Citation Urbahns, KHärter, MAlbers, MSchmidt, DStelte-Ludwig, BBrüggemeier, UVaupel, AKeldenich, JLustig, KTsujishita, HGerdes, C Biphenyls as potent vitronectin receptor antagonists. Part 3: Squaric acid amides. Bioorg Med Chem Lett17:6151-4 (2007) 
 
Albumin
Name:Albumin
Type:PROTEIN
Mol. Mass.:69362.94
Organism:Homo sapiens (Human)
Description:ChEMBL_1509401
Residue:609
BDBM50125289
NameBDBM50125289
Synonyms:(S)-3-[3'-(3-Cyclopropyl-ureido)-biphenyl-4-yl]-2-(2,4,6-trimethyl-benzenesulfonylamino)-propionic acid | CHEMBL10811
TypeSmall organic molecule
Emp. Form.C28H31N3O5S
Mol. Mass.521.628
SMILESCc1cc(C)c(c(C)c1)S(=O)(=O)N[C@@H](Cc1ccc(cc1)-c1cccc(NC(=O)NC2CC2)c1)C(O)=O