Reaction Details
TargetCannabinoid receptor 2
LigandBDBM50224061
Substrate/Competitorn/a
Meas. Tech.ChEMBL_450409 (CHEMBL900693)
Ki 30.9±n/a nM
Citation Stern, EMuccioli, GGBosier, BHamtiaux, LMillet, RPoupaert, JHHénichart, JPDepreux, PGoossens, JFLambert, DM Pharmacomodulations around the 4-oxo-1,4-dihydroquinoline-3-carboxamides, a class of potent CB2-selective cannabinoid receptor ligands: consequences in receptor affinity and functionality. J Med Chem50:5471-84 (2007) 
 
Cannabinoid receptor 2
Name:Cannabinoid receptor 2
Type:G Protein-Coupled Receptor (GPCR)
Mol. Mass.:39690.94
Organism:Homo sapiens (Human)
Description:P34972
Residue:360
BDBM50224061
NameBDBM50224061
Synonyms:CHEMBL392288 | N3-(1-(3,5-dimethyl)adamantyl)-4-oxo-1-pentyl-1,4-dihydro-[1,6]-naphthyridine-3-carboxamide
TypeSmall organic molecule
Emp. Form.C26H35N3O2
Mol. Mass.421.575
SMILESCCCCCn1cc(C(=O)NC23CC4CC(C)(CC(C)(C4)C2)C3)c(=O)c2cnccc12