Reaction Details
TargetCannabinoid receptor 2
LigandBDBM50180028
Substrate/Competitorn/a
Meas. Tech.ChEMBL_450409 (CHEMBL900693)
Ki 1010±n/a nM
Citation Stern, EMuccioli, GGBosier, BHamtiaux, LMillet, RPoupaert, JHHénichart, JPDepreux, PGoossens, JFLambert, DM Pharmacomodulations around the 4-oxo-1,4-dihydroquinoline-3-carboxamides, a class of potent CB2-selective cannabinoid receptor ligands: consequences in receptor affinity and functionality. J Med Chem50:5471-84 (2007) 
 
Cannabinoid receptor 2
Name:Cannabinoid receptor 2
Type:G Protein-Coupled Receptor (GPCR)
Mol. Mass.:39690.94
Organism:Homo sapiens (Human)
Description:P34972
Residue:360
BDBM50180028
NameBDBM50180028
Synonyms:(+)-N3-(1-(1,2,3,4-tetrahydronaphthyl))-4-oxo-1-pentyl-1,4-dihydroquinoline-3-carboxamide (RS)-N3-(1-(1,2,3,4-tetrahydronaphthyl))-4-oxo-1-pentyl-1,4-dihydroquinoline-3-carboxamide | CHEMBL380610
TypeSmall organic molecule
Emp. Form.C25H28N2O2
Mol. Mass.388.502
SMILESCCCCCn1cc(C(=O)NC2CCCc3ccccc23)c(=O)c2ccccc12