Reaction Details
TargetCannabinoid receptor 2
LigandBDBM50224083
Substrate/Competitorn/a
Meas. Tech.ChEMBL_450409 (CHEMBL900693)
Ki 83.4±n/a nM
Citation Stern, EMuccioli, GGBosier, BHamtiaux, LMillet, RPoupaert, JHHénichart, JPDepreux, PGoossens, JFLambert, DM Pharmacomodulations around the 4-oxo-1,4-dihydroquinoline-3-carboxamides, a class of potent CB2-selective cannabinoid receptor ligands: consequences in receptor affinity and functionality. J Med Chem50:5471-84 (2007) 
 
Cannabinoid receptor 2
Name:Cannabinoid receptor 2
Type:G Protein-Coupled Receptor (GPCR)
Mol. Mass.:39690.94
Organism:Homo sapiens (Human)
Description:P34972
Residue:360
BDBM50224083
NameBDBM50224083
Synonyms:CHEMBL238047 | N3-(1-(3,5-dimethyl)adamantyl)-4-oxo-1-(4-fluorobenzyl)-1,4-dihydroquinoline-3-carboxamide
TypeSmall organic molecule
Emp. Form.C29H31FN2O2
Mol. Mass.458.567
SMILESCC12CC3CC(C)(C1)CC(C3)(C2)NC(=O)c1cn(Cc2ccc(F)cc2)c2ccccc2c1=O