Reaction Details
TargetCalcitonin gene-related peptide type 1 receptor
LigandBDBM50224425
Substrate/Competitorn/a
Meas. Tech.ChEMBL_450786 (CHEMBL899871)
IC50 150±n/a nM
Citation Paone, DVShaw, AWNguyen, DNBurgey, CSDeng, JZKane, SAKoblan, KSSalvatore, CAMosser, SDJohnston, VKWong, BKMiller-Stein, CMHershey, JCGraham, SLVacca, JPWilliams, TM Potent, orally bioavailable calcitonin gene-related peptide receptor antagonists for the treatment of migraine: discovery of N-[(3R,6S)-6-(2,3-difluorophenyl)-2-oxo-1- (2,2,2-trifluoroethyl)azepan-3-yl]-4- (2-oxo-2,3-dihydro-1H-imidazo[4,5-b]pyridin- 1-yl)piperidine-1-carboxamide (MK-0974). J Med Chem50:5564-7 (2007) 
 
Calcitonin gene-related peptide type 1 receptor
Name:Calcitonin gene-related peptide type 1 receptor
Type:Enzyme Catalytic Domain
Mol. Mass.:52980.45
Organism:Homo sapiens (Human)
Description:Q16602
Residue:461
BDBM50224425
NameBDBM50224425
Synonyms:CHEMBL241118 | N-[(3R)-6-(2-fluorophenyl)-2-oxoazepan-3-yl]-4-(2-oxo-2,3-dihydro-1H-imidazo[4,5-b]pyridin-1-yl)piperidine-1-carboxamide
TypeSmall organic molecule
Emp. Form.C24H27FN6O3
Mol. Mass.466.508
SMILESFc1ccccc1C1CC[C@@H](NC(=O)N2CCC(CC2)n2c3cccnc3[nH]c2=O)C(=O)NC1