Reaction Details
TargetCalcitonin gene-related peptide type 1 receptor
LigandBDBM50224412
Substrate/Competitorn/a
Meas. Tech.ChEMBL_450787 (CHEMBL899872)
IC50 10±n/a nM
Citation Paone, DVShaw, AWNguyen, DNBurgey, CSDeng, JZKane, SAKoblan, KSSalvatore, CAMosser, SDJohnston, VKWong, BKMiller-Stein, CMHershey, JCGraham, SLVacca, JPWilliams, TM Potent, orally bioavailable calcitonin gene-related peptide receptor antagonists for the treatment of migraine: discovery of N-[(3R,6S)-6-(2,3-difluorophenyl)-2-oxo-1- (2,2,2-trifluoroethyl)azepan-3-yl]-4- (2-oxo-2,3-dihydro-1H-imidazo[4,5-b]pyridin- 1-yl)piperidine-1-carboxamide (MK-0974). J Med Chem50:5564-7 (2007) 
 
Calcitonin gene-related peptide type 1 receptor
Name:Calcitonin gene-related peptide type 1 receptor
Type:Enzyme Catalytic Domain
Mol. Mass.:52980.45
Organism:Homo sapiens (Human)
Description:Q16602
Residue:461
BDBM50224412
NameBDBM50224412
Synonyms:CHEMBL392635 | N-[(3R,6S)-6-(2,3-difluorophenyl)-2-oxo-1-(pyridin-2-ylmethyl)azepan-3-yl]-4-(2-oxo-2,3-dihydro-1H-imidazo[4,5-b]pyridin-1-yl)piperidine-1-carboxamide
TypeSmall organic molecule
Emp. Form.C30H31F2N7O3
Mol. Mass.575.609
SMILESFc1cccc([C@@H]2CC[C@@H](NC(=O)N3CCC(CC3)n3c4cccnc4[nH]c3=O)C(=O)N(Cc3ccccn3)C2)c1F