Reaction Details
TargetCalcitonin gene-related peptide type 1 receptor
LigandBDBM50224437
Substrate/Competitorn/a
Meas. Tech.ChEMBL_450785 (CHEMBL899870)
Ki 470±n/a nM
Citation Paone, DVShaw, AWNguyen, DNBurgey, CSDeng, JZKane, SAKoblan, KSSalvatore, CAMosser, SDJohnston, VKWong, BKMiller-Stein, CMHershey, JCGraham, SLVacca, JPWilliams, TM Potent, orally bioavailable calcitonin gene-related peptide receptor antagonists for the treatment of migraine: discovery of N-[(3R,6S)-6-(2,3-difluorophenyl)-2-oxo-1- (2,2,2-trifluoroethyl)azepan-3-yl]-4- (2-oxo-2,3-dihydro-1H-imidazo[4,5-b]pyridin- 1-yl)piperidine-1-carboxamide (MK-0974). J Med Chem50:5564-7 (2007) 
 
Calcitonin gene-related peptide type 1 receptor
Name:Calcitonin gene-related peptide type 1 receptor
Type:Enzyme Catalytic Domain
Mol. Mass.:52980.45
Organism:Homo sapiens (Human)
Description:Q16602
Residue:461
BDBM50224437
NameBDBM50224437
Synonyms:4-(2-oxo-2,3-dihydro-1H-imidazo[4,5-b]pyridin-1-yl)-N-[(3R)-2-oxo-6-(3-thienyl)azepan-3-yl]piperidine-1-carboxamide | CHEMBL240686
TypeSmall organic molecule
Emp. Form.C22H26N6O3S
Mol. Mass.454.545
SMILESO=C(N[C@@H]1CCC(CNC1=O)c1ccsc1)N1CCC(CC1)n1c2cccnc2[nH]c1=O