Reaction Details
TargetSerine/threonine-protein kinase Chk1
LigandBDBM15248
Substrate/Competitorn/a
Meas. Tech.ChEMBL_450842 (CHEMBL899928)
IC50 11±n/a nM
Citation Li, GTao, ZFTong, YPrzytulinska, MKKovar, PMerta, PChen, ZZhang, HSowin, TRosenberg, SHLin, NH Synthesis and in-vitro biological activity of macrocyclic urea Chk1 inhibitors. Bioorg Med Chem Lett17:6499-504 (2007) 
 
Serine/threonine-protein kinase Chk1
Name:Serine/threonine-protein kinase Chk1
Type:Enzyme Catalytic Domain
Mol. Mass.:54443.02
Organism:Homo sapiens (Human)
Description:gi_166295192
Residue:476
BDBM15248
NameBDBM15248
Synonyms:7-chloro-3-oxo-11,17-dioxa-2,4,20,22-tetraazatricyclo[16.3.1.0^{5,10}]docosa-1(21),5(10),6,8,18(22),19-hexaene-19-carbonitrile macrocyclic inhibitor 5b
TypeSmall organic molecule
Emp. Form.C17H16ClN5O3
Mol. Mass.373.794
SMILESClc1ccc2OCCCCCOc3nc(NC(=O)Nc2c1)cnc3C#N