Reaction Details
TargetAurora kinase A
LigandBDBM50224733
Substrate/Competitorn/a
Meas. Tech.ChEMBL_450875 (CHEMBL899962)
IC50 7000±n/a nM
Citation Bavetsias, VSun, CBouloc, NReynisson, JWorkman, PLinardopoulos, SMcDonald, E Hit generation and exploration: imidazo[4,5-b]pyridine derivatives as inhibitors of Aurora kinases. Bioorg Med Chem Lett17:6567-71 (2007) 
 
Aurora kinase A
Name:Aurora kinase A
Type:Serine/threonine-protein kinase
Mol. Mass.:45830.98
Organism:Homo sapiens (Human)
Description:O14965
Residue:403
BDBM50224733
NameBDBM50224733
Synonyms:CHEMBL391394 | N,N-dimethyl-4-(7-methyl-3H-imidazo[4,5-b]pyridin-2-yl)benzenamine
TypeSmall organic molecule
Emp. Form.C15H16N4
Mol. Mass.252.3143
SMILESCN(C)c1ccc(cc1)-c1nc2nccc(C)c2[nH]1