Reaction Details
TargetAurora kinase A
LigandBDBM50045027
Substrate/Competitorn/a
Meas. Tech.ChEMBL_450875 (CHEMBL899962)
IC50 29000±n/a nM
Citation Bavetsias, VSun, CBouloc, NReynisson, JWorkman, PLinardopoulos, SMcDonald, E Hit generation and exploration: imidazo[4,5-b]pyridine derivatives as inhibitors of Aurora kinases. Bioorg Med Chem Lett17:6567-71 (2007) 
 
Aurora kinase A
Name:Aurora kinase A
Type:Serine/threonine-protein kinase
Mol. Mass.:45830.98
Organism:Homo sapiens (Human)
Description:O14965
Residue:403
BDBM50045027
NameBDBM50045027
Synonyms:2-(2-Methoxy-phenyl)-3H-imidazo[4,5-b]pyridine; hydrochloride CHEMBL543042
TypeSmall organic molecule
Emp. Form.C13H11N3O
Mol. Mass.225.2459
SMILESCOc1ccccc1-c1nc2ncccc2[nH]1