Reaction Details
TargetAurora kinase A
LigandBDBM50224738
Substrate/Competitorn/a
Meas. Tech.ChEMBL_450875 (CHEMBL899962)
IC50 2400±n/a nM
Citation Bavetsias, VSun, CBouloc, NReynisson, JWorkman, PLinardopoulos, SMcDonald, E Hit generation and exploration: imidazo[4,5-b]pyridine derivatives as inhibitors of Aurora kinases. Bioorg Med Chem Lett17:6567-71 (2007) 
 
Aurora kinase A
Name:Aurora kinase A
Type:Serine/threonine-protein kinase
Mol. Mass.:45830.98
Organism:Homo sapiens (Human)
Description:O14965
Residue:403
BDBM50224738
NameBDBM50224738
Synonyms:4-(7-chloro-3H-imidazo[4,5-b]pyridin-2-yl)-N,N-dimethylbenzenamine | CHEMBL237369
TypeSmall organic molecule
Emp. Form.C14H13ClN4
Mol. Mass.272.733
SMILESCN(C)c1ccc(cc1)-c1nc2nccc(Cl)c2[nH]1