Reaction Details
TargetAurora kinase A
LigandBDBM50224742
Substrate/Competitorn/a
Meas. Tech.ChEMBL_450875 (CHEMBL899962)
IC50 870±n/a nM
Citation Bavetsias, VSun, CBouloc, NReynisson, JWorkman, PLinardopoulos, SMcDonald, E Hit generation and exploration: imidazo[4,5-b]pyridine derivatives as inhibitors of Aurora kinases. Bioorg Med Chem Lett17:6567-71 (2007) 
 
Aurora kinase A
Name:Aurora kinase A
Type:Serine/threonine-protein kinase
Mol. Mass.:45830.98
Organism:Homo sapiens (Human)
Description:O14965
Residue:403
BDBM50224742
NameBDBM50224742
Synonyms:2-(4-(2-(4-(dimethylamino)phenyl)-3H-imidazo[4,5-b]pyridin-7-yl)piperazin-1-yl)-N-(thiazol-2-yl)acetamide | CHEMBL412173
TypeSmall organic molecule
Emp. Form.C23H26N8OS
Mol. Mass.462.571
SMILESCN(C)c1ccc(cc1)-c1nc2nccc(N3CCN(CC(=O)Nc4nccs4)CC3)c2[nH]1