Reaction Details
TargetAurora kinase A
LigandBDBM50224744
Substrate/Competitorn/a
Meas. Tech.ChEMBL_450875 (CHEMBL899962)
IC50 98000±n/a nM
Citation Bavetsias, VSun, CBouloc, NReynisson, JWorkman, PLinardopoulos, SMcDonald, E Hit generation and exploration: imidazo[4,5-b]pyridine derivatives as inhibitors of Aurora kinases. Bioorg Med Chem Lett17:6567-71 (2007) 
 
Aurora kinase A
Name:Aurora kinase A
Type:Serine/threonine-protein kinase
Mol. Mass.:45830.98
Organism:Homo sapiens (Human)
Description:O14965
Residue:403
BDBM50224744
NameBDBM50224744
Synonyms:2-(4-(6,7-dimethoxyquinazolin-4-yl)piperazin-1-yl)-1-(pyrrolidin-1-yl)ethanone | CHEMBL236279
TypeSmall organic molecule
Emp. Form.C20H27N5O3
Mol. Mass.385.4601
SMILESCOc1cc2ncnc(N3CCN(CC(=O)N4CCCC4)CC3)c2cc1OC