Reaction Details
TargetAurora kinase A
LigandBDBM50224751
Substrate/Competitorn/a
Meas. Tech.ChEMBL_450875 (CHEMBL899962)
IC50 4400±n/a nM
Citation Bavetsias, VSun, CBouloc, NReynisson, JWorkman, PLinardopoulos, SMcDonald, E Hit generation and exploration: imidazo[4,5-b]pyridine derivatives as inhibitors of Aurora kinases. Bioorg Med Chem Lett17:6567-71 (2007) 
 
Aurora kinase A
Name:Aurora kinase A
Type:Serine/threonine-protein kinase
Mol. Mass.:45830.98
Organism:Homo sapiens (Human)
Description:O14965
Residue:403
BDBM50224751
NameBDBM50224751
Synonyms:2-(4-(piperidin-2-yl)phenyl)-3H-imidazo[4,5-b]pyridine | CHEMBL237142
TypeSmall organic molecule
Emp. Form.C17H18N4
Mol. Mass.278.3516
SMILESC1CCC(NC1)c1ccc(cc1)-c1nc2ncccc2[nH]1