Reaction Details
TargetAurora kinase A
LigandBDBM50224753
Substrate/Competitorn/a
Meas. Tech.ChEMBL_450875 (CHEMBL899962)
IC50 9000±n/a nM
Citation Bavetsias, VSun, CBouloc, NReynisson, JWorkman, PLinardopoulos, SMcDonald, E Hit generation and exploration: imidazo[4,5-b]pyridine derivatives as inhibitors of Aurora kinases. Bioorg Med Chem Lett17:6567-71 (2007) 
 
Aurora kinase A
Name:Aurora kinase A
Type:Serine/threonine-protein kinase
Mol. Mass.:45830.98
Organism:Homo sapiens (Human)
Description:O14965
Residue:403
BDBM50224753
NameBDBM50224753
Synonyms:1-(3-(2-(4-(dimethylamino)phenyl)-3H-imidazo[4,5-b]pyridin-6-yl)phenyl)ethanone | CHEMBL394674
TypeSmall organic molecule
Emp. Form.C22H20N4O
Mol. Mass.356.4204
SMILESCN(C)c1ccc(cc1)-c1nc2ncc(cc2[nH]1)-c1cccc(c1)C(C)=O