Reaction Details
TargetTransient receptor potential cation channel subfamily V member 1
LigandBDBM50241325
Substrate/Competitorn/a
Meas. Tech.ChEMBL_458533 (CHEMBL942791)
IC50 0.40±n/a nM
Citation Wang, XChakrabarti, PPOgnyanov, VIPettus, LHTamir, RTan, HTang, PTreanor, JJGavva, NRNorman, MH Trisubstituted pyrimidines as transient receptor potential vanilloid 1 (TRPV1) antagonists with improved solubility. Bioorg Med Chem Lett17:6539-45 (2007) 
 
Transient receptor potential cation channel subfamily V member 1
Name:Transient receptor potential cation channel subfamily V member 1
Type:Transient Receptor
Mol. Mass.:94956.12
Organism:Rattus norvegicus (rat)
Description:O35433
Residue:838
BDBM50241325
NameBDBM50241325
Synonyms:CHEMBL251348 | N-(4-(2-(1-isobutyl-1,2,3,6-tetrahydropyridin-4-yl)-6-(4-(trifluoromethyl)phenyl)pyrimidin-4-yloxy)benzo[d]thiazol-2-yl)acetamide
TypeSmall organic molecule
Emp. Form.C29H28F3N5O2S
Mol. Mass.567.625
SMILESCC(C)CN1CCC(=CC1)c1nc(Oc2cccc3sc(NC(C)=O)nc23)cc(n1)-c1ccc(cc1)C(F)(F)F