Reaction Details
TargetMelanocortin receptor 4
LigandBDBM50225589
Substrate/Competitorn/a
Meas. Tech.ChEMBL_458679 (CHEMBL942962)
EC50 170±n/a nM
Citation Chen, CWTran, JAFleck, BATucci, FCJiang, WChen, C Synthesis and characterization of trans-4-(4-chlorophenyl)pyrrolidine-3-carboxamides of piperazinecyclohexanes as ligands for the melanocortin-4 receptor. Bioorg Med Chem Lett17:6825-31 (2007) 
 
Melanocortin receptor 4
Name:Melanocortin receptor 4
Type:Enzyme
Mol. Mass.:36949.50
Organism:Homo sapiens (Human)
Description:P32245
Residue:332
BDBM50225589
NameBDBM50225589
Synonyms:(4-(1-((3-fluoro-4-methoxybenzylamino)methyl)cyclohexyl)piperazin-1-yl)((3R,4S)-4-(4-chlorophenyl)-1-isopropylpyrrolidin-3-yl)methanone | CHEMBL398929
TypeSmall organic molecule
Emp. Form.C33H46ClFN4O2
Mol. Mass.585.195
SMILESCOc1ccc(CNCC2(CCCCC2)N2CCN(CC2)C(=O)[C@H]2CN(C[C@@H]2c2ccc(Cl)cc2)C(C)C)cc1F