Reaction Details
TargetC-X-C chemokine receptor type 3
LigandBDBM50225734
Substrate/Competitorn/a
Meas. Tech.ChEMBL_458685 (CHEMBL942022)
Ki 880±n/a nM
Citation Watson, RJAllen, DRBirch, HLChapman, GAHannah, DRKnight, RLMeissner, JWOwen, DAThomas, EJ Development of CXCR3 antagonists. Part 2: Identification of 2-amino(4-piperidinyl)azoles as potent CXCR3 antagonists. Bioorg Med Chem Lett17:6806-10 (2007) 
 
C-X-C chemokine receptor type 3
Name:C-X-C chemokine receptor type 3
Type:Enzyme Catalytic Domain
Mol. Mass.:40665.65
Organism:Homo sapiens (Human)
Description:n/a
Residue:368
BDBM50225734
NameBDBM50225734
Synonyms:1-(((1R,5S)-6,6-dimethylbicyclo[3.1.1]hept-2-en-2-yl)methyl)-N-(4-phenylthiazol-2-yl)piperidin-4-amine | CHEMBL250633
TypeSmall organic molecule
Emp. Form.C24H31N3S
Mol. Mass.393.588
SMILESCC1(C)[C@@H]2C[C@H]1C(CN1CCC(CC1)Nc1nc(cs1)-c1ccccc1)=CC2