Reaction Details
TargetDipeptidyl peptidase 4
LigandBDBM50226066
Substrate/Competitorn/a
Meas. Tech.ChEMBL_458753 (CHEMBL943037)
IC50 5.3±n/a nM
Citation Corbett, JWDirico, KSong, WBoscoe, BPDoran, SDBoyer, DQiu, XAmmirati, MVanvolkenburg, MAMcPherson, RKParker, JCCox, ED Design and synthesis of potent amido- and benzyl-substituted cis-3-amino-4-(2-cyanopyrrolidide)pyrrolidinyl DPP-IV inhibitors. Bioorg Med Chem Lett17:6707-13 (2007) 
 
Dipeptidyl peptidase 4
Name:Dipeptidyl peptidase 4
Type:Enzyme
Mol. Mass.:88271.01
Organism:Homo sapiens (Human)
Description:P27487
Residue:766
BDBM50226066
NameBDBM50226066
Synonyms:(S)-1-((3R,4R)-1-(4-(3-methyl-1H-1,2,4-triazol-1-yl)benzyl)-3-aminopyrrolidine-4-carbonyl)pyrrolidine-2-carbonitrile | CHEMBL248794
TypeSmall organic molecule
Emp. Form.C20H25N7O
Mol. Mass.379.4588
SMILESCc1ncn(n1)-c1ccc(CN2C[C@H](N)[C@@H](C2)C(=O)N2CCC[C@H]2C#N)cc1