Reaction Details
TargetDipeptidyl peptidase 4
LigandBDBM50226065
Substrate/Competitorn/a
Meas. Tech.ChEMBL_458753 (CHEMBL943037)
IC50 3.2±n/a nM
Citation Corbett, JWDirico, KSong, WBoscoe, BPDoran, SDBoyer, DQiu, XAmmirati, MVanvolkenburg, MAMcPherson, RKParker, JCCox, ED Design and synthesis of potent amido- and benzyl-substituted cis-3-amino-4-(2-cyanopyrrolidide)pyrrolidinyl DPP-IV inhibitors. Bioorg Med Chem Lett17:6707-13 (2007) 
 
Dipeptidyl peptidase 4
Name:Dipeptidyl peptidase 4
Type:Enzyme
Mol. Mass.:88271.01
Organism:Homo sapiens (Human)
Description:P27487
Residue:766
BDBM50226065
NameBDBM50226065
Synonyms:(S)-1-((3R,4R)-1-(4-(1H-1,2,4-triazol-1-yl)benzyl)-3-aminopyrrolidine-4-carbonyl)pyrrolidine-2-carbonitrile | CHEMBL399525
TypeSmall organic molecule
Emp. Form.C19H23N7O
Mol. Mass.365.4322
SMILESN[C@H]1CN(Cc2ccc(cc2)-n2cncn2)C[C@H]1C(=O)N1CCC[C@H]1C#N