Reaction Details
TargetDipeptidyl peptidase 4
LigandBDBM50226077
Substrate/Competitorn/a
Meas. Tech.ChEMBL_458753 (CHEMBL943037)
IC50>3±n/a nM
Citation Corbett, JWDirico, KSong, WBoscoe, BPDoran, SDBoyer, DQiu, XAmmirati, MVanvolkenburg, MAMcPherson, RKParker, JCCox, ED Design and synthesis of potent amido- and benzyl-substituted cis-3-amino-4-(2-cyanopyrrolidide)pyrrolidinyl DPP-IV inhibitors. Bioorg Med Chem Lett17:6707-13 (2007) 
 
Dipeptidyl peptidase 4
Name:Dipeptidyl peptidase 4
Type:Enzyme
Mol. Mass.:88271.01
Organism:Homo sapiens (Human)
Description:P27487
Residue:766
BDBM50226077
NameBDBM50226077
Synonyms:(3S,4S)-4-amino-3-(pyrrolidine-1-carbonyl)-1-(quinoxaline-3-carbonyl)pyrrolidin-2-one | CHEMBL399348
TypeSmall organic molecule
Emp. Form.C18H19N5O3
Mol. Mass.353.3752
SMILESN[C@@H]1CN(C(=O)c2cnc3ccccc3n2)C(=O)[C@@H]1C(=O)N1CCCC1