Reaction Details
TargetDipeptidyl peptidase 4
LigandBDBM50226064
Substrate/Competitorn/a
Meas. Tech.ChEMBL_458753 (CHEMBL943037)
IC50 1.3±n/a nM
Citation Corbett, JWDirico, KSong, WBoscoe, BPDoran, SDBoyer, DQiu, XAmmirati, MVanvolkenburg, MAMcPherson, RKParker, JCCox, ED Design and synthesis of potent amido- and benzyl-substituted cis-3-amino-4-(2-cyanopyrrolidide)pyrrolidinyl DPP-IV inhibitors. Bioorg Med Chem Lett17:6707-13 (2007) 
 
Dipeptidyl peptidase 4
Name:Dipeptidyl peptidase 4
Type:Enzyme
Mol. Mass.:88271.01
Organism:Homo sapiens (Human)
Description:P27487
Residue:766
BDBM50226064
NameBDBM50226064
Synonyms:4-(((3R,4R)-3-amino-4-((2R)-2-cyanocyclopentanecarbonyl)pyrrolidin-1-yl)methyl)-2-methylbenzonitrile | CHEMBL429115
TypeSmall organic molecule
Emp. Form.C20H24N4O
Mol. Mass.336.4308
SMILESCc1cc(CN2C[C@H](N)[C@@H](C2)C(=O)C2CCC[C@H]2C#N)ccc1C#N