Reaction Details
TargetDipeptidyl peptidase 4
LigandBDBM50226088
Substrate/Competitorn/a
Meas. Tech.ChEMBL_458753 (CHEMBL943037)
IC50 5.5±n/a nM
Citation Corbett, JWDirico, KSong, WBoscoe, BPDoran, SDBoyer, DQiu, XAmmirati, MVanvolkenburg, MAMcPherson, RKParker, JCCox, ED Design and synthesis of potent amido- and benzyl-substituted cis-3-amino-4-(2-cyanopyrrolidide)pyrrolidinyl DPP-IV inhibitors. Bioorg Med Chem Lett17:6707-13 (2007) 
 
Dipeptidyl peptidase 4
Name:Dipeptidyl peptidase 4
Type:Enzyme
Mol. Mass.:88271.01
Organism:Homo sapiens (Human)
Description:P27487
Residue:766
BDBM50226088
NameBDBM50226088
Synonyms:(S)-1-((3R,4R)-3-amino-1-(1-(4-cyanophenyl)ethyl)pyrrolidine-4-carbonyl)pyrrolidine-2-carbonitrile | CHEMBL249601
TypeSmall organic molecule
Emp. Form.C19H23N5O
Mol. Mass.337.4188
SMILESCC(N1C[C@H](N)[C@@H](C1)C(=O)N1CCC[C@H]1C#N)c1ccc(cc1)C#N