Reaction Details
TargetDipeptidyl peptidase 4
LigandBDBM50226102
Substrate/Competitorn/a
Meas. Tech.ChEMBL_458753 (CHEMBL943037)
IC50 4.7±n/a nM
Citation Corbett, JWDirico, KSong, WBoscoe, BPDoran, SDBoyer, DQiu, XAmmirati, MVanvolkenburg, MAMcPherson, RKParker, JCCox, ED Design and synthesis of potent amido- and benzyl-substituted cis-3-amino-4-(2-cyanopyrrolidide)pyrrolidinyl DPP-IV inhibitors. Bioorg Med Chem Lett17:6707-13 (2007) 
 
Dipeptidyl peptidase 4
Name:Dipeptidyl peptidase 4
Type:Enzyme
Mol. Mass.:88271.01
Organism:Homo sapiens (Human)
Description:P27487
Residue:766
BDBM50226102
NameBDBM50226102
Synonyms:4-(((3R,4R)-3-amino-4-((2R)-2-cyanocyclopentanecarbonyl)pyrrolidin-1-yl)methyl)-2,6-diethylbenzonitrile | CHEMBL429482
TypeSmall organic molecule
Emp. Form.C23H30N4O
Mol. Mass.378.5105
SMILESCCc1cc(CN2C[C@H](N)[C@@H](C2)C(=O)C2CCC[C@H]2C#N)cc(CC)c1C#N