Reaction Details
TargetSomatostatin receptor type 5
LigandBDBM24226
Substrate/Competitorn/a
Meas. Tech.ChEMBL_452331 (CHEMBL902568)
Ki 4070±n/a nM
Citation Martin, REGreen, LGGuba, WKratochwil, NChrist, A Discovery of the first nonpeptidic, small-molecule, highly selective somatostatin receptor subtype 5 antagonists: a chemogenomics approach. J Med Chem50:6291-4 (2007) 
 
Somatostatin receptor type 5
Name:Somatostatin receptor type 5
Type:Enzyme
Mol. Mass.:39218.02
Organism:Homo sapiens (Human)
Description:P35346
Residue:364
BDBM24226
NameBDBM24226
Synonyms:1-[(4-fluorophenyl)methyl]-N-{1-[2-(4-methoxyphenyl)ethyl]piperidin-4-yl}-1H-1,3-benzodiazol-2-amine Astemizole, [O-Methyl-3H] Hismanal [3H]-ASTEMIZOLE cid_2247 | med.21724, Compound Astemizole
TypeRadiolabeled ligand
Emp. Form.C28H31FN4O
Mol. Mass.458.5703
SMILESCOc1ccc(CCN2CCC(CC2)Nc2nc3ccccc3n2Cc2ccc(F)cc2)cc1