Reaction Details
TargetSomatostatin receptor type 5
LigandBDBM50227130
Substrate/Competitorn/a
Meas. Tech.ChEMBL_452345 (CHEMBL902582)
Ki 40±n/a nM
Citation Guba, WGreen, LGMartin, RERoche, OKratochwil, NMauser, HBissantz, CChrist, AStahl, M From astemizole to a novel hit series of small-molecule somatostatin 5 receptor antagonists via GPCR affinity profiling. J Med Chem50:6295-8 (2007) 
 
Somatostatin receptor type 5
Name:Somatostatin receptor type 5
Type:Enzyme
Mol. Mass.:39218.02
Organism:Homo sapiens (Human)
Description:P35346
Residue:364
BDBM50227130
NameBDBM50227130
Synonyms:CHEMBL241328 | N-(1-((1,4-dimethoxynaphthalen-2-yl)methyl)piperidin-4-yl)-5-methylnicotinamide
TypeSmall organic molecule
Emp. Form.C25H29N3O3
Mol. Mass.419.5161
SMILESCOc1cc(CN2CCC(CC2)NC(=O)c2cncc(C)c2)c(OC)c2ccccc12