Reaction Details
TargetDisintegrin and metalloproteinase domain-containing protein 10
LigandBDBM50227993
Substrate/Competitorn/a
Meas. Tech.ChEMBL_461663 (CHEMBL927684)
IC50 33±n/a nM
Citation Yao, WZhuo, JBurns, DMLi, YLQian, DQZhang, CHe, CXu, MShi, ELi, YMarando, CACovington, MBYang, GLiu, XPan, MFridman, JSScherle, PWasserman, ZRHollis, GVaddi, KYeleswaram, SNewton, RFriedman, SMetcalf, B Design and identification of selective HER-2 sheddase inhibitors via P1' manipulation and unconventional P2' perturbations to induce a molecular metamorphosis. Bioorg Med Chem Lett18:159-63 (2008) 
 
Disintegrin and metalloproteinase domain-containing protein 10
Name:Disintegrin and metalloproteinase domain-containing protein 10
Type:Enzyme
Mol. Mass.:84160.93
Organism:Homo sapiens (Human)
Description:O14672
Residue:748
BDBM50227993
NameBDBM50227993
Synonyms:(6S,7S)-6-[4-(3-ethyl-phenyl)-3,6-dihydro-2H-pyridine-1-carbonyl]-5-aza-spiro[2.5]octane-7-carboxylic acid hydroxyamide | CHEMBL402954
TypeSmall organic molecule
Emp. Form.C22H29N3O3
Mol. Mass.383.484
SMILESCCc1cccc(c1)C1=CCN(CC1)C(=O)[C@H]1NCC2(CC2)C[C@@H]1C(=O)NO