Reaction Details
TargetDisintegrin and metalloproteinase domain-containing protein 10
LigandBDBM50227992
Substrate/Competitorn/a
Meas. Tech.ChEMBL_461663 (CHEMBL927684)
IC50 34±n/a nM
Citation Yao, WZhuo, JBurns, DMLi, YLQian, DQZhang, CHe, CXu, MShi, ELi, YMarando, CACovington, MBYang, GLiu, XPan, MFridman, JSScherle, PWasserman, ZRHollis, GVaddi, KYeleswaram, SNewton, RFriedman, SMetcalf, B Design and identification of selective HER-2 sheddase inhibitors via P1' manipulation and unconventional P2' perturbations to induce a molecular metamorphosis. Bioorg Med Chem Lett18:159-63 (2008) 
 
Disintegrin and metalloproteinase domain-containing protein 10
Name:Disintegrin and metalloproteinase domain-containing protein 10
Type:Enzyme
Mol. Mass.:84160.93
Organism:Homo sapiens (Human)
Description:O14672
Residue:748
BDBM50227992
NameBDBM50227992
Synonyms:(6S,7S)-7-hydroxycarbamoyl-6-(4-phenyl-3,4-dihydro-2H-pyridine-1-carbonyl)-5-aza-spiro[2.5]octane-5-carboxylic acid benzyl ester | CHEMBL252678
TypeSmall organic molecule
Emp. Form.C28H31N3O5
Mol. Mass.489.5628
SMILESONC(=O)[C@H]1CC2(CC2)CN([C@@H]1C(=O)N1CCC(C=C1)c1ccccc1)C(=O)OCc1ccccc1