Reaction Details
TargetDisintegrin and metalloproteinase domain-containing protein 10
LigandBDBM50227994
Substrate/Competitorn/a
Meas. Tech.ChEMBL_461663 (CHEMBL927684)
IC50 27±n/a nM
Citation Yao, WZhuo, JBurns, DMLi, YLQian, DQZhang, CHe, CXu, MShi, ELi, YMarando, CACovington, MBYang, GLiu, XPan, MFridman, JSScherle, PWasserman, ZRHollis, GVaddi, KYeleswaram, SNewton, RFriedman, SMetcalf, B Design and identification of selective HER-2 sheddase inhibitors via P1' manipulation and unconventional P2' perturbations to induce a molecular metamorphosis. Bioorg Med Chem Lett18:159-63 (2008) 
 
Disintegrin and metalloproteinase domain-containing protein 10
Name:Disintegrin and metalloproteinase domain-containing protein 10
Type:Enzyme
Mol. Mass.:84160.93
Organism:Homo sapiens (Human)
Description:O14672
Residue:748
BDBM50227994
NameBDBM50227994
Synonyms:(6S,7S)-5-methanesulfonyl-6-(4-phenyl-piperazine-1-carbonyl)-5-aza-spiro[2.5]octane-7-carboxylic acid hydroxyamide | CHEMBL446457
TypeSmall organic molecule
Emp. Form.C20H28N4O5S
Mol. Mass.436.525
SMILESCS(=O)(=O)N1CC2(CC2)C[C@@H]([C@H]1C(=O)N1CCN(CC1)c1ccccc1)C(=O)NO