Reaction Details
TargetCruzipain
LigandBDBM50229132
Substrate/Competitorn/a
Meas. Tech.ChEMBL_461748 (CHEMBL928879)
Ki 92±n/a nM
Citation Jaishankar, PHansell, EZhao, DMDoyle, PSMcKerrow, JHRenslo, AR Potency and selectivity of P2/P3-modified inhibitors of cysteine proteases from trypanosomes. Bioorg Med Chem Lett18:624-8 (2008) 
 
Cruzipain
Name:Cruzipain
Type:Protein
Mol. Mass.:49831.41
Organism:Trypanosoma cruzi
Description:P25779
Residue:467
BDBM50229132
NameBDBM50229132
Synonyms:CHEMBL254066 | N-((S)-1-oxo-1-((S)-5-phenyl-1-(phenylsulfonyl)pent-1-en-3-ylamino)-3-m-tolylpropan-2-yl)-4-(trifluoromethyl)benzamide
TypeSmall organic molecule
Emp. Form.C35H33F3N2O4S
Mol. Mass.634.708
SMILESCc1cccc(C[C@H](NC(=O)c2ccc(cc2)C(F)(F)F)C(=O)N[C@@H](CCc2ccccc2)\C=C\S(=O)(=O)c2ccccc2)c1