Reaction Details
TargetHistone deacetylase 1
LigandBDBM50229191
Substrate/Competitorn/a
Meas. Tech.ChEMBL_461755 (CHEMBL927761)
IC50 17±n/a nM
Citation Witter, DJHarrington, PWilson, KJChenard, MFleming, JCHaines, BKral, AMSecrist, JPMiller, TA Optimization of biaryl Selective HDAC1&2 Inhibitors (SHI-1:2). Bioorg Med Chem Lett18:726-31 (2008) 
 
Histone deacetylase 1
Name:Histone deacetylase 1
Type:Enzyme
Mol. Mass.:55090.27
Organism:Homo sapiens (Human)
Description:Q13547
Residue:482
BDBM50229191
NameBDBM50229191
Synonyms:CHEMBL252409 [4-(4-amino-biphenyl-3-ylcarbamoyl)-benzyl]-carbamic acid benzyl ester
TypeSmall organic molecule
Emp. Form.C28H25N3O3
Mol. Mass.451.5164
SMILESNc1ccc(cc1NC(=O)c1ccc(CNC(=O)OCc2ccccc2)cc1)-c1ccccc1