Reaction Details
TargetHistone deacetylase 2
LigandBDBM50229193
Substrate/Competitorn/a
Meas. Tech.ChEMBL_461756 (CHEMBL927762)
IC50 105±n/a nM
Citation Witter, DJHarrington, PWilson, KJChenard, MFleming, JCHaines, BKral, AMSecrist, JPMiller, TA Optimization of biaryl Selective HDAC1&2 Inhibitors (SHI-1:2). Bioorg Med Chem Lett18:726-31 (2008) 
 
Histone deacetylase 2
Name:Histone deacetylase 2
Type:Chromatin regulator; hydrolase; repressor
Mol. Mass.:55356.54
Organism:Homo sapiens (Human)
Description:Q92769
Residue:488
BDBM50229193
NameBDBM50229193
Synonyms:CHEMBL400721 methyl 4-((2-amino-5-(thiophen-2-yl)phenyl)carbamoyl)benzylcarbamate
TypeSmall organic molecule
Emp. Form.C20H19N3O3S
Mol. Mass.381.448
SMILESCOC(=O)NCc1ccc(cc1)C(=O)Nc1cc(ccc1N)-c1cccs1