Reaction Details
TargetHistone deacetylase 6
LigandBDBM50229197
Substrate/Competitorn/a
Meas. Tech.ChEMBL_461760 (CHEMBL927766)
IC50>50000±n/a nM
Citation Witter, DJHarrington, PWilson, KJChenard, MFleming, JCHaines, BKral, AMSecrist, JPMiller, TA Optimization of biaryl Selective HDAC1&2 Inhibitors (SHI-1:2). Bioorg Med Chem Lett18:726-31 (2008) 
 
Histone deacetylase 6
Name:Histone deacetylase 6
Type:Chromatin regulator; hydrolase; repressor
Mol. Mass.:131381.51
Organism:Homo sapiens (Human)
Description:Q9UBN7
Residue:1215
BDBM50229197
NameBDBM50229197
Synonyms:CHEMBL399494 ethyl 4-((2-amino-5-(thiophen-2-yl)phenyl)carbamoyl)benzylcarbamate
TypeSmall organic molecule
Emp. Form.C21H21N3O3S
Mol. Mass.395.475
SMILESCCOC(=O)NCc1ccc(cc1)C(=O)Nc1cc(ccc1N)-c1cccs1