Reaction Details
TargetHistone deacetylase 8
LigandBDBM50229189
Substrate/Competitorn/a
Meas. Tech.ChEMBL_461762 (CHEMBL927768)
IC50>20000±n/a nM
Citation Witter, DJHarrington, PWilson, KJChenard, MFleming, JCHaines, BKral, AMSecrist, JPMiller, TA Optimization of biaryl Selective HDAC1&2 Inhibitors (SHI-1:2). Bioorg Med Chem Lett18:726-31 (2008) 
 
Histone deacetylase 8
Name:Histone deacetylase 8
Type:Enzyme
Mol. Mass.:41749.60
Organism:Homo sapiens (Human)
Description:Q9BY41
Residue:377
BDBM50229189
NameBDBM50229189
Synonyms:CHEMBL253868 [4-(4-amino-biphenyl-3-ylcarbamoyl)-benzyl]-carbamic acid pyridin-3-ylmethyl ester
TypeSmall organic molecule
Emp. Form.C27H24N4O3
Mol. Mass.452.5045
SMILESNc1ccc(cc1NC(=O)c1ccc(CNC(=O)OCc2cccnc2)cc1)-c1ccccc1