Reaction Details
TargetHistone deacetylase 6
LigandBDBM50229192
Substrate/Competitorn/a
Meas. Tech.ChEMBL_461760 (CHEMBL927766)
IC50>50000±n/a nM
Citation Witter, DJHarrington, PWilson, KJChenard, MFleming, JCHaines, BKral, AMSecrist, JPMiller, TA Optimization of biaryl Selective HDAC1&2 Inhibitors (SHI-1:2). Bioorg Med Chem Lett18:726-31 (2008) 
 
Histone deacetylase 6
Name:Histone deacetylase 6
Type:Chromatin regulator; hydrolase; repressor
Mol. Mass.:131381.51
Organism:Homo sapiens (Human)
Description:Q9UBN7
Residue:1215
BDBM50229192
NameBDBM50229192
Synonyms:CHEMBL398420 US9096559, 9 | [4-(4-amino-biphenyl-3-ylcarbamoyl)-benzyl]-carbamic acid methyl ester
TypeSmall organic molecule
Emp. Form.C22H21N3O3
Mol. Mass.375.4204
SMILESCOC(=O)NCc1ccc(cc1)C(=O)Nc1cc(ccc1N)-c1ccccc1