Reaction Details
TargetProstaglandin G/H synthase 1
LigandBDBM22369
Substrate/Competitorn/a
Meas. Tech.ChEMBL_461799 (CHEMBL927805)
IC50 40000±n/a nM
Citation Singh, PMittal, ABhardwaj, AKaur, SKumar, S 1-Toluene-sulfonyl-3-[(3'-hydroxy-5'-substituted)-gamma-butyrolactone]-indoles: synthesis, COX-2 inhibition and anti-cancer activities. Bioorg Med Chem Lett18:85-9 (2008) 
 
Prostaglandin G/H synthase 1
Name:Prostaglandin G/H synthase 1
Type:Protein
Mol. Mass.:68868.60
Organism:Ovis aries (Sheep)
Description:n/a
Residue:600
BDBM22369
NameBDBM22369
Synonyms:4-(4-methanesulfonylphenyl)-3-phenyl-2,5-dihydrofuran-2-one MK 0966 US11478464, Compound Rofecoxib | US11786535, Compound Rofecoxib
TypeSmall organic molecule
Emp. Form.C17H14O4S
Mol. Mass.314.356
SMILESCS(=O)(=O)c1ccc(cc1)C1=C(C(=O)OC1)c1ccccc1