Reaction Details
TargetMatrix metalloproteinase-9
LigandBDBM50229639
Substrate/Competitorn/a
Meas. Tech.ChEMBL_461866 (CHEMBL927859)
IC50 25±n/a nM
Citation Burns, DMHe, CLi, YScherle, PLiu, XMarando, CACovington, MBYang, GPan, MTurner, SFridman, JSHollis, GVaddi, KYeleswaram, SNewton, RFriedman, SMetcalf, BYao, W Conversion of an MMP-potent scaffold to an MMP-selective HER-2 sheddase inhibitor via scaffold hybridization and subtle P1' permutations. Bioorg Med Chem Lett18:560-4 (2008) 
 
Matrix metalloproteinase-9
Name:Matrix metalloproteinase-9
Type:Enzyme
Mol. Mass.:78452.28
Organism:Homo sapiens (Human)
Description:P14780
Residue:707
BDBM50229639
NameBDBM50229639
Synonyms:(S)-tetrahydrofuran-3-yl 4-(hydroxycarbamoyl)-4-((4-phenyl-5,6-dihydropyridin-1(2H)-ylsulfonyl)methyl)piperidine-1-carboxylate | CHEMBL251820
TypeSmall organic molecule
Emp. Form.C23H31N3O7S
Mol. Mass.493.573
SMILESONC(=O)C1(CS(=O)(=O)N2CCC(=CC2)c2ccccc2)CCN(CC1)C(=O)O[C@H]1CCOC1