Reaction Details
TargetDisintegrin and metalloproteinase domain-containing protein 10
LigandBDBM50229656
Substrate/Competitorn/a
Meas. Tech.ChEMBL_461861 (CHEMBL927854)
IC50 16±n/a nM
Citation Burns, DMHe, CLi, YScherle, PLiu, XMarando, CACovington, MBYang, GPan, MTurner, SFridman, JSHollis, GVaddi, KYeleswaram, SNewton, RFriedman, SMetcalf, BYao, W Conversion of an MMP-potent scaffold to an MMP-selective HER-2 sheddase inhibitor via scaffold hybridization and subtle P1' permutations. Bioorg Med Chem Lett18:560-4 (2008) 
 
Disintegrin and metalloproteinase domain-containing protein 10
Name:Disintegrin and metalloproteinase domain-containing protein 10
Type:Enzyme
Mol. Mass.:84160.93
Organism:Homo sapiens (Human)
Description:O14672
Residue:748
BDBM50229656
NameBDBM50229656
Synonyms:CHEMBL252612 | pyrrolidin-3-yl 4-(hydroxycarbamoyl)-4-((4-o-tolylpiperidin-1-ylsulfonyl)methyl)piperidine-1-carboxylate
TypeSmall organic molecule
Emp. Form.C24H36N4O6S
Mol. Mass.508.631
SMILESCc1ccccc1C1CCN(CC1)S(=O)(=O)CC1(CCN(CC1)C(=O)OC1CCNC1)C(=O)NO