Reaction Details
Target72 kDa type IV collagenase
LigandBDBM50229639
Substrate/Competitorn/a
Meas. Tech.ChEMBL_461864 (CHEMBL927857)
IC50 4±n/a nM
Citation Burns, DMHe, CLi, YScherle, PLiu, XMarando, CACovington, MBYang, GPan, MTurner, SFridman, JSHollis, GVaddi, KYeleswaram, SNewton, RFriedman, SMetcalf, BYao, W Conversion of an MMP-potent scaffold to an MMP-selective HER-2 sheddase inhibitor via scaffold hybridization and subtle P1' permutations. Bioorg Med Chem Lett18:560-4 (2008) 
 
72 kDa type IV collagenase
Name:72 kDa type IV collagenase
Type:Enzyme
Mol. Mass.:73870.36
Organism:Homo sapiens (Human)
Description: P08253
Residue:660
BDBM50229639
NameBDBM50229639
Synonyms:(S)-tetrahydrofuran-3-yl 4-(hydroxycarbamoyl)-4-((4-phenyl-5,6-dihydropyridin-1(2H)-ylsulfonyl)methyl)piperidine-1-carboxylate | CHEMBL251820
TypeSmall organic molecule
Emp. Form.C23H31N3O7S
Mol. Mass.493.573
SMILESONC(=O)C1(CS(=O)(=O)N2CCC(=CC2)c2ccccc2)CCN(CC1)C(=O)O[C@H]1CCOC1