Reaction Details
Target72 kDa type IV collagenase
LigandBDBM50229635
Substrate/Competitorn/a
Meas. Tech.ChEMBL_461864 (CHEMBL927857)
IC50 574±n/a nM
Citation Burns, DMHe, CLi, YScherle, PLiu, XMarando, CACovington, MBYang, GPan, MTurner, SFridman, JSHollis, GVaddi, KYeleswaram, SNewton, RFriedman, SMetcalf, BYao, W Conversion of an MMP-potent scaffold to an MMP-selective HER-2 sheddase inhibitor via scaffold hybridization and subtle P1' permutations. Bioorg Med Chem Lett18:560-4 (2008) 
 
72 kDa type IV collagenase
Name:72 kDa type IV collagenase
Type:Enzyme
Mol. Mass.:73870.36
Organism:Homo sapiens (Human)
Description: P08253
Residue:660
BDBM50229635
NameBDBM50229635
Synonyms:4,4-dimethyl-tetrahydrofuran-3-yl 4-(hydroxycarbamoyl)-4-((4-o-tolylpiperidin-1-ylsulfonyl)methyl)piperidine-1-carboxylate | CHEMBL439405
TypeSmall organic molecule
Emp. Form.C26H39N3O7S
Mol. Mass.537.669
SMILESCc1ccccc1C1CCN(CC1)S(=O)(=O)CC1(CCN(CC1)C(=O)OC1COCC1(C)C)C(=O)NO