Reaction Details
TargetInterstitial collagenase
LigandBDBM50229657
Substrate/Competitorn/a
Meas. Tech.ChEMBL_461863 (CHEMBL927856)
IC50 774±n/a nM
Citation Burns, DMHe, CLi, YScherle, PLiu, XMarando, CACovington, MBYang, GPan, MTurner, SFridman, JSHollis, GVaddi, KYeleswaram, SNewton, RFriedman, SMetcalf, BYao, W Conversion of an MMP-potent scaffold to an MMP-selective HER-2 sheddase inhibitor via scaffold hybridization and subtle P1' permutations. Bioorg Med Chem Lett18:560-4 (2008) 
 
Interstitial collagenase
Name:Interstitial collagenase
Type:Enzyme
Mol. Mass.:54010.26
Organism:Homo sapiens (Human)
Description: P03956
Residue:469
BDBM50229657
NameBDBM50229657
Synonyms:(S)-tetrahydrofuran-3-yl 4-(hydroxycarbamoyl)-4-((4-phenylpiperazin-1-ylsulfonyl)methyl)piperidine-1-carboxylate | CHEMBL399351
TypeSmall organic molecule
Emp. Form.C22H32N4O7S
Mol. Mass.496.577
SMILESONC(=O)C1(CS(=O)(=O)N2CCN(CC2)c2ccccc2)CCN(CC1)C(=O)O[C@H]1CCOC1