Reaction Details
Target72 kDa type IV collagenase
LigandBDBM50229657
Substrate/Competitorn/a
Meas. Tech.ChEMBL_461864 (CHEMBL927857)
IC50 13±n/a nM
Citation Burns, DMHe, CLi, YScherle, PLiu, XMarando, CACovington, MBYang, GPan, MTurner, SFridman, JSHollis, GVaddi, KYeleswaram, SNewton, RFriedman, SMetcalf, BYao, W Conversion of an MMP-potent scaffold to an MMP-selective HER-2 sheddase inhibitor via scaffold hybridization and subtle P1' permutations. Bioorg Med Chem Lett18:560-4 (2008) 
 
72 kDa type IV collagenase
Name:72 kDa type IV collagenase
Type:Enzyme
Mol. Mass.:73870.36
Organism:Homo sapiens (Human)
Description: P08253
Residue:660
BDBM50229657
NameBDBM50229657
Synonyms:(S)-tetrahydrofuran-3-yl 4-(hydroxycarbamoyl)-4-((4-phenylpiperazin-1-ylsulfonyl)methyl)piperidine-1-carboxylate | CHEMBL399351
TypeSmall organic molecule
Emp. Form.C22H32N4O7S
Mol. Mass.496.577
SMILESONC(=O)C1(CS(=O)(=O)N2CCN(CC2)c2ccccc2)CCN(CC1)C(=O)O[C@H]1CCOC1