Reaction Details
TargetProtein kinase C alpha type
LigandBDBM50229772
Substrate/Competitorn/a
Meas. Tech.ChEMBL_460208 (CHEMBL927258)
Ki 43±n/a nM
Citation Yanagita, RCNakagawa, YYamanaka, NKashiwagi, KSaito, NIrie, K Synthesis, conformational analysis, and biological evaluation of 1-hexylindolactam-V10 as a selective activator for novel protein kinase C isozymes. J Med Chem51:46-56 (2008) 
 
Protein kinase C alpha type
Name:Protein kinase C alpha type
Type:Enzyme
Mol. Mass.:76755.65
Organism:Homo sapiens (Human)
Description:The recombinant human PKC enzymes were produced using a baculovirus expression system in SF9 cells
Residue:672
BDBM50229772
NameBDBM50229772
Synonyms:1-hexylindolactam-V | CHEMBL399981
TypeSmall organic molecule
Emp. Form.C23H35N3O2
Mol. Mass.385.5429
SMILESCCCCCCn1cc2C[C@@H](CO)NC(=O)[C@H](C(C)C)N(C)c3cccc1c23